TEXT: 
============================================
================= Results ==================
=============== Consumed Time ==============
    armeabi-v7a GtsMediaTestCases: 6h 55m 51s
    armeabi-v7a GtsExoPlayerTestCases: 59m 14s
    armeabi-v7a GtsGmscoreHostTestCases: 35m 31s
    armeabi-v7a GtsStatsdHostTestCases: 7m 19s
    armeabi-v7a GtsEdiHostTestCases: 4m 57s
    armeabi-v7a GtsDevicePolicyGmsInstrumentationTestCases: 2m 31s
    armeabi-v7a GtsStagedInstallHostTestCases: 2m 16s
    armeabi-v7a GtsSecurityHostTestCases: 2m 1s
    armeabi-v7a GtsFeaturesTestCases: 1m 54s
    armeabi-v7a GtsRollbackManagerTest: 1m 39s
    armeabi-v7a GtsPlayStoreHostTestCases: 1m 35s
    armeabi-v7a GtsArtManagerHostTestCases: 1m 26s
    armeabi-v7a CtsEdiHostTestCases: 1m 16s
    armeabi-v7a GtsPackageManagerHostTestCases: 1m 6s
    armeabi-v7a GtsDevicePolicyTestCases: 1m 0s
    armeabi-v7a GtsPermissionTestCases: 54s
    armeabi-v7a GtsYouTubeTestCases: 46s
    armeabi-v7a GtsPermissionUiTestCases: 44s
    armeabi-v7a GtsBootStatsTestCases: 43s
    armeabi-v7a GtsHealthConnectTests: 40s
    armeabi-v7a GtsSuspendAppsTestCases: 39s
    armeabi-v7a GtsAppTestCases: 38s
    armeabi-v7a GtsPackageInstallTestCases: 35s
    armeabi-v7a GtsNotificationTestCases: 34s
    armeabi-v7a GtsDuoReadyTestCases: 32s
    armeabi-v7a GtsLocationTestCases: 31s
    armeabi-v7a GtsPlacementTestCases: 31s
    armeabi-v7a GtsNetTestCases: 31s
    armeabi-v7a GtsContentTestCases: 31s
    armeabi-v7a GtsUnofficialApisUsageTestCases: 30s
    armeabi-v7a GtsOsTestCases: 28s
    armeabi-v7a GtsDozeDeviceTestCases: 28s
    armeabi-v7a GtsNetworkWatchlistTestCases: 26s
    armeabi-v7a GtsMbaPrivilegedPermissionTestCases: 26s
    armeabi-v7a GtsBackupTestCases: 25s
    armeabi-v7a GtsDeviceConfigTestCases: 24s
    armeabi-v7a GtsLargeApkHostTestCases: 23s
    armeabi-v7a GtsTvTestCases: 21s
    armeabi-v7a GtsPrintTestCases: 21s
    armeabi-v7a GtsPersonalSafetyTestCases: 20s
    armeabi-v7a GtsBackupHostTestCases: 20s
    armeabi-v7a GtsLensTestCases: 20s
    armeabi-v7a GtsPlayAutoInstallTestCases: 19s
    armeabi-v7a GtsNmgiarcTestCases: 19s
    armeabi-v7a GtsTelephonyTestCases: 19s
    armeabi-v7a GtsWellbeingTestCases: 19s
    armeabi-v7a GtsUsageStatsTestCases: 18s
    armeabi-v7a GtsWebViewTestCases: 18s
    armeabi-v7a GtsTelecomManagerTests: 18s
    armeabi-v7a GtsTetheringTestCases: 17s
    armeabi-v7a GtsRlzTestCases: 17s
    armeabi-v7a GtsAssistIntentTestCases: 17s
    armeabi-v7a GtsWallpaperTestCases: 17s
    armeabi-v7a GtsAppBlacklistDeviceTestCases: 16s
    armeabi-v7a GtsViewTestCases: 16s
    armeabi-v7a GtsCameraTestCases: 16s
    armeabi-v7a GtsNoPermissionTestCases: 16s
    armeabi-v7a GtsAndroidAutoDeviceTestCases: 16s
    armeabi-v7a GtsContextHubPermissionDeviceTestCases: 16s
    armeabi-v7a GtsNoPermissionTestCases25: 16s
    armeabi-v7a GtsRegulationComplianceTestCases: 16s
    armeabi-v7a GtsAfwTestCases: 16s
    armeabi-v7a GtsPackageInstallerTapjackingTestCases: 15s
    armeabi-v7a GtsOemLockServiceTestCases: 15s
    armeabi-v7a GtsContactsTest: 15s
    armeabi-v7a GtsSuspendAppsPermissionTestCases: 15s
    armeabi-v7a GtsSettingsTestCases: 14s
    armeabi-v7a GtsIncidentManagerTestCases: 14s
    armeabi-v7a GtsSupervisionTestCases: 14s
    armeabi-v7a GtsCalendarTests: 14s
    armeabi-v7a GtsDialerAudioTestCases: 14s
    armeabi-v7a GtsThemingTestCases: 14s
    armeabi-v7a GtsSimAppDialogTestCases: 14s
    armeabi-v7a GtsAdminTestCases: 14s
    armeabi-v7a GtsWellbeingPermissionPolicyTestCases: 14s
    armeabi-v7a GtsStorageTestCases: 13s
    armeabi-v7a GtsTelephonyNumberVerificationHostCases: 13s
    armeabi-v7a GtsPackageRoleEnforcementTests: 13s
    armeabi-v7a GtsTvBugReportTestCases: 13s
    armeabi-v7a GtsSpeechServicesTestCases: 13s
    armeabi-v7a GtsContactsAppDeviceTestCases: 13s
    armeabi-v7a GtsPackageUninstallTestCases: 13s
    armeabi-v7a GtsIntelligenceTestCases: 13s
    armeabi-v7a GtsAppVisibilityDeviceTestCases: 13s
    armeabi-v7a GtsCNGCoreTestCases: 13s
    armeabi-v7a GtsPropertiesTestCases: 12s
    armeabi-v7a GtsInstallPackagesWhitelistDeviceTestCases: 12s
    armeabi-v7a GtsEntertainmentSpaceDeviceTestCases: 12s
    armeabi-v7a GtsMemoryTestCases: 12s
    armeabi-v7a GtsPackageNameCertPairsDeviceTestCases: 12s
    armeabi-v7a GtsSafetyCenterTestCases: 12s
    armeabi-v7a GtsCallLogTestCases: 12s
    armeabi-v7a GtsVoiceInteractionHostTestCases: 12s
    armeabi-v7a GtsFilesByGoogleTestCases: 12s
    armeabi-v7a GtsPrivacyTestCases: 12s
    armeabi-v7a GtsPartnerBookmarksTestCases: 12s
    armeabi-v7a GtsModuleMetadataTestCases: 12s
    armeabi-v7a GtsSmartBatteryDeviceTestCases: 12s
    armeabi-v7a GtsSetupWizardNoPermissionTestCases: 12s
    armeabi-v7a GtsNetStatsHostTestCases: 12s
    armeabi-v7a GtsSsaidHostTestCases: 11s
    armeabi-v7a GtsLocationHostTestCases: 10s
    armeabi-v7a GtsCastHostTestCases: 10s
    armeabi-v7a GtsSensorHostTestCases: 10s
    armeabi-v7a GtsIncrementalInstallProxyHostTestCases: 9s
    armeabi-v7a GtsNetworkStackHostTestCases: 8s
    armeabi-v7a GtsPermissionControllerHostTestCases: 6s
    armeabi-v7a GtsSetupWizardHostTestCases: 6s
    armeabi-v7a GtsAssistantHostTestCases: 5s
    armeabi-v7a GtsTvHostTestCases: 3s
    armeabi-v7a GtsMemoryHostTestCases: 3s
    armeabi-v7a GtsInstantAppsHostTestCases: 3s
    armeabi-v7a GtsContentHostTestCases: 2s
    armeabi-v7a GtsWebViewHostTestCases: 2s
    armeabi-v7a GtsGraphicsHostTestCases: 2s
    armeabi-v7a GtsDozeHostSideTestCases: 2s
    armeabi-v7a GtsSettingsHostTestCases: 1s
    armeabi-v7a GtsAssistantMicHostTestCases: 1s
    armeabi-v7a GtsWellbeingHostTestCases: 1s
    armeabi-v7a GtsPreserveLegacyStorageHostTest: 1s
    armeabi-v7a GtsKidsHomeHostTestCases: 1s
    armeabi-v7a GtsUserspaceRebootHostSideTestCases: 1s
    armeabi-v7a GtsSearchHostTestCases: 1s
    armeabi-v7a GtsEntertainmentSpaceHostTestCases: 1s
    armeabi-v7a GtsVndkDependencyTestCases: 995 ms
    armeabi-v7a GtsLinkerConfigTestCases: 922 ms
    armeabi-v7a GtsHomeHostTestCases: 902 ms
    armeabi-v7a GtsGameOverlayTestCases: 901 ms
    armeabi-v7a GtsScreenshotHostTestCases: 872 ms
    armeabi-v7a GtsBootHealthHostTestCases: 792 ms
    armeabi-v7a CtsClasspathDeviceInfoTestCases: 746 ms
    armeabi-v7a CtsScopedStorageHostTest: 0 ms
Total aggregated tests run time: 9h 30m 19s
============== TOP 109 Slow Modules ==============
    armeabi-v7a GtsRollbackManagerTest: 0.01 tests/sec [1 tests / 99380 msec]
    armeabi-v7a GtsExoPlayerTestCases: 0.01 tests/sec [42 tests / 3554807 msec]
    armeabi-v7a GtsMediaTestCases: 0.02 tests/sec [571 tests / 24951484 msec]
    armeabi-v7a GtsBootStatsTestCases: 0.02 tests/sec [1 tests / 43550 msec]
    armeabi-v7a GtsEdiHostTestCases: 0.02 tests/sec [7 tests / 297950 msec]
    armeabi-v7a GtsLargeApkHostTestCases: 0.04 tests/sec [1 tests / 23393 msec]
    armeabi-v7a GtsStagedInstallHostTestCases: 0.05 tests/sec [7 tests / 136700 msec]
    armeabi-v7a GtsAppTestCases: 0.05 tests/sec [2 tests / 38487 msec]
    armeabi-v7a CtsEdiHostTestCases: 0.05 tests/sec [4 tests / 76383 msec]
    armeabi-v7a GtsPlayStoreHostTestCases: 0.05 tests/sec [5 tests / 95103 msec]
    armeabi-v7a GtsAppBlacklistDeviceTestCases: 0.06 tests/sec [1 tests / 16987 msec]
    armeabi-v7a GtsContextHubPermissionDeviceTestCases: 0.06 tests/sec [1 tests / 16277 msec]
    armeabi-v7a GtsPackageInstallerTapjackingTestCases: 0.07 tests/sec [1 tests / 15366 msec]
    armeabi-v7a GtsPermissionUiTestCases: 0.07 tests/sec [3 tests / 44565 msec]
    armeabi-v7a GtsDialerAudioTestCases: 0.07 tests/sec [1 tests / 14299 msec]
    armeabi-v7a GtsThemingTestCases: 0.07 tests/sec [1 tests / 14214 msec]
    armeabi-v7a GtsStorageTestCases: 0.07 tests/sec [1 tests / 13934 msec]
    armeabi-v7a GtsTelephonyNumberVerificationHostCases: 0.07 tests/sec [1 tests / 13795 msec]
    armeabi-v7a GtsPackageRoleEnforcementTests: 0.07 tests/sec [1 tests / 13781 msec]
    armeabi-v7a GtsTvBugReportTestCases: 0.07 tests/sec [1 tests / 13665 msec]
    armeabi-v7a GtsContactsAppDeviceTestCases: 0.07 tests/sec [1 tests / 13508 msec]
    armeabi-v7a GtsPackageUninstallTestCases: 0.08 tests/sec [1 tests / 13298 msec]
    armeabi-v7a GtsIntelligenceTestCases: 0.08 tests/sec [1 tests / 13270 msec]
    armeabi-v7a GtsCNGCoreTestCases: 0.08 tests/sec [1 tests / 13059 msec]
    armeabi-v7a GtsPropertiesTestCases: 0.08 tests/sec [1 tests / 12988 msec]
    armeabi-v7a GtsInstallPackagesWhitelistDeviceTestCases: 0.08 tests/sec [1 tests / 12779 msec]
    armeabi-v7a GtsEntertainmentSpaceDeviceTestCases: 0.08 tests/sec [1 tests / 12617 msec]
    armeabi-v7a GtsMemoryTestCases: 0.08 tests/sec [1 tests / 12468 msec]
    armeabi-v7a GtsPackageNameCertPairsDeviceTestCases: 0.08 tests/sec [1 tests / 12458 msec]
    armeabi-v7a GtsSafetyCenterTestCases: 0.08 tests/sec [1 tests / 12443 msec]
    armeabi-v7a GtsCallLogTestCases: 0.08 tests/sec [1 tests / 12424 msec]
    armeabi-v7a GtsArtManagerHostTestCases: 0.08 tests/sec [7 tests / 86806 msec]
    armeabi-v7a GtsFilesByGoogleTestCases: 0.08 tests/sec [1 tests / 12345 msec]
    armeabi-v7a GtsPrivacyTestCases: 0.08 tests/sec [1 tests / 12342 msec]
    armeabi-v7a GtsPartnerBookmarksTestCases: 0.08 tests/sec [1 tests / 12308 msec]
    armeabi-v7a GtsModuleMetadataTestCases: 0.08 tests/sec [1 tests / 12272 msec]
    armeabi-v7a GtsSmartBatteryDeviceTestCases: 0.08 tests/sec [1 tests / 12259 msec]
    armeabi-v7a GtsSetupWizardNoPermissionTestCases: 0.08 tests/sec [1 tests / 12248 msec]
    armeabi-v7a GtsNetStatsHostTestCases: 0.08 tests/sec [1 tests / 12187 msec]
    armeabi-v7a GtsStatsdHostTestCases: 0.09 tests/sec [39 tests / 439196 msec]
    armeabi-v7a GtsCastHostTestCases: 0.10 tests/sec [1 tests / 10276 msec]
    armeabi-v7a GtsUnofficialApisUsageTestCases: 0.10 tests/sec [3 tests / 30081 msec]
    armeabi-v7a GtsYouTubeTestCases: 0.11 tests/sec [5 tests / 46801 msec]
    armeabi-v7a GtsNetworkWatchlistTestCases: 0.11 tests/sec [3 tests / 26880 msec]
    armeabi-v7a GtsAssistIntentTestCases: 0.12 tests/sec [2 tests / 17247 msec]
    armeabi-v7a GtsViewTestCases: 0.12 tests/sec [2 tests / 16767 msec]
    armeabi-v7a GtsNoPermissionTestCases: 0.12 tests/sec [2 tests / 16449 msec]
    armeabi-v7a GtsAndroidAutoDeviceTestCases: 0.12 tests/sec [2 tests / 16352 msec]
    armeabi-v7a GtsDeviceConfigTestCases: 0.12 tests/sec [3 tests / 24373 msec]
    armeabi-v7a GtsNoPermissionTestCases25: 0.12 tests/sec [2 tests / 16242 msec]
    armeabi-v7a GtsHealthConnectTests: 0.12 tests/sec [5 tests / 40249 msec]
    armeabi-v7a GtsNetTestCases: 0.13 tests/sec [4 tests / 31136 msec]
    armeabi-v7a GtsSupervisionTestCases: 0.14 tests/sec [2 tests / 14375 msec]
    armeabi-v7a GtsCalendarTests: 0.14 tests/sec [2 tests / 14349 msec]
    armeabi-v7a GtsPrintTestCases: 0.14 tests/sec [3 tests / 21324 msec]
    armeabi-v7a GtsWellbeingPermissionPolicyTestCases: 0.14 tests/sec [2 tests / 14149 msec]
    armeabi-v7a GtsGmscoreHostTestCases: 0.15 tests/sec [319 tests / 2131552 msec]
    armeabi-v7a GtsAppVisibilityDeviceTestCases: 0.15 tests/sec [2 tests / 13225 msec]
    armeabi-v7a GtsUsageStatsTestCases: 0.16 tests/sec [3 tests / 18710 msec]
    armeabi-v7a GtsCameraTestCases: 0.18 tests/sec [3 tests / 16620 msec]
    armeabi-v7a GtsPackageManagerHostTestCases: 0.18 tests/sec [12 tests / 66281 msec]
    armeabi-v7a GtsRegulationComplianceTestCases: 0.19 tests/sec [3 tests / 16055 msec]
    armeabi-v7a GtsLocationHostTestCases: 0.19 tests/sec [2 tests / 10473 msec]
    armeabi-v7a GtsSensorHostTestCases: 0.20 tests/sec [2 tests / 10116 msec]
    armeabi-v7a GtsContactsTest: 0.20 tests/sec [3 tests / 15025 msec]
    armeabi-v7a GtsSettingsTestCases: 0.20 tests/sec [3 tests / 14815 msec]
    armeabi-v7a GtsNotificationTestCases: 0.20 tests/sec [7 tests / 34171 msec]
    armeabi-v7a GtsSimAppDialogTestCases: 0.21 tests/sec [3 tests / 14190 msec]
    armeabi-v7a GtsVoiceInteractionHostTestCases: 0.24 tests/sec [3 tests / 12376 msec]
    armeabi-v7a GtsSsaidHostTestCases: 0.25 tests/sec [3 tests / 11966 msec]
    armeabi-v7a GtsSuspendAppsPermissionTestCases: 0.27 tests/sec [4 tests / 15003 msec]
    armeabi-v7a GtsPackageInstallTestCases: 0.28 tests/sec [10 tests / 35680 msec]
    armeabi-v7a GtsAdminTestCases: 0.28 tests/sec [4 tests / 14157 msec]
    armeabi-v7a GtsDevicePolicyGmsInstrumentationTestCases: 0.29 tests/sec [44 tests / 151899 msec]
    armeabi-v7a GtsAfwTestCases: 0.31 tests/sec [5 tests / 16030 msec]
    armeabi-v7a GtsOemLockServiceTestCases: 0.33 tests/sec [5 tests / 15346 msec]
    armeabi-v7a GtsSecurityHostTestCases: 0.34 tests/sec [41 tests / 121375 msec]
    armeabi-v7a GtsIncidentManagerTestCases: 0.35 tests/sec [5 tests / 14406 msec]
    armeabi-v7a GtsRlzTestCases: 0.35 tests/sec [6 tests / 17260 msec]
    armeabi-v7a GtsWallpaperTestCases: 0.35 tests/sec [6 tests / 17108 msec]
    armeabi-v7a GtsNmgiarcTestCases: 0.35 tests/sec [7 tests / 19933 msec]
    armeabi-v7a GtsTvTestCases: 0.37 tests/sec [8 tests / 21843 msec]
    armeabi-v7a GtsSpeechServicesTestCases: 0.37 tests/sec [5 tests / 13587 msec]
    armeabi-v7a GtsWebViewTestCases: 0.38 tests/sec [7 tests / 18663 msec]
    armeabi-v7a GtsSuspendAppsTestCases: 0.38 tests/sec [15 tests / 39950 msec]
    armeabi-v7a GtsTelecomManagerTests: 0.38 tests/sec [7 tests / 18275 msec]
    armeabi-v7a GtsTetheringTestCases: 0.39 tests/sec [7 tests / 17914 msec]
    armeabi-v7a GtsPlayAutoInstallTestCases: 0.40 tests/sec [8 tests / 19950 msec]
    armeabi-v7a GtsFeaturesTestCases: 0.46 tests/sec [53 tests / 114247 msec]
    armeabi-v7a GtsMbaPrivilegedPermissionTestCases: 0.49 tests/sec [13 tests / 26482 msec]
    armeabi-v7a GtsDozeDeviceTestCases: 0.49 tests/sec [14 tests / 28383 msec]
    armeabi-v7a GtsLensTestCases: 0.50 tests/sec [10 tests / 20127 msec]
    armeabi-v7a GtsPersonalSafetyTestCases: 0.58 tests/sec [12 tests / 20838 msec]
    armeabi-v7a GtsLocationTestCases: 0.60 tests/sec [19 tests / 31821 msec]
    armeabi-v7a GtsPermissionTestCases: 0.66 tests/sec [36 tests / 54613 msec]
    armeabi-v7a GtsDevicePolicyTestCases: 0.73 tests/sec [44 tests / 60665 msec]
    armeabi-v7a GtsDuoReadyTestCases: 0.85 tests/sec [28 tests / 32760 msec]
    armeabi-v7a GtsPlacementTestCases: 0.92 tests/sec [29 tests / 31539 msec]
    armeabi-v7a GtsNetworkStackHostTestCases: 0.92 tests/sec [8 tests / 8649 msec]
    armeabi-v7a GtsContentTestCases: 1.03 tests/sec [32 tests / 31025 msec]
    armeabi-v7a GtsOsTestCases: 1.04 tests/sec [30 tests / 28953 msec]
    armeabi-v7a GtsBackupTestCases: 1.11 tests/sec [28 tests / 25128 msec]
    armeabi-v7a GtsPermissionControllerHostTestCases: 1.40 tests/sec [9 tests / 6419 msec]
    armeabi-v7a GtsAssistantHostTestCases: 1.48 tests/sec [8 tests / 5412 msec]
    armeabi-v7a GtsWellbeingTestCases: 1.77 tests/sec [34 tests / 19202 msec]
    armeabi-v7a GtsBackupHostTestCases: 2.43 tests/sec [50 tests / 20572 msec]
    armeabi-v7a GtsSetupWizardHostTestCases: 2.93 tests/sec [18 tests / 6145 msec]
    armeabi-v7a GtsTelephonyTestCases: 3.94 tests/sec [78 tests / 19783 msec]
    armeabi-v7a GtsIncrementalInstallProxyHostTestCases: 4.05 tests/sec [38 tests / 9392 msec]
============== Modules Preparation Times ==============
    armeabi-v7a GtsViewTestCases => prep = 3500 ms || clean = 1329 ms
    armeabi-v7a GtsArtManagerHostTestCases => prep = 3357 ms || clean = 1523 ms
    armeabi-v7a GtsPrivacyTestCases => prep = 3820 ms || clean = 1267 ms
    armeabi-v7a GtsOsTestCases => prep = 4292 ms || clean = 1448 ms
    armeabi-v7a GtsAndroidAutoDeviceTestCases => prep = 3882 ms || clean = 1418 ms
    armeabi-v7a GtsLinkerConfigTestCases => prep = 0 ms || clean = 636 ms
    armeabi-v7a GtsWellbeingPermissionPolicyTestCases => prep = 3555 ms || clean = 1257 ms
    armeabi-v7a GtsUsageStatsTestCases => prep = 6974 ms || clean = 1862 ms
    armeabi-v7a GtsAfwTestCases => prep = 3519 ms || clean = 1303 ms
    armeabi-v7a GtsStorageTestCases => prep = 4446 ms || clean = 1430 ms
    armeabi-v7a GtsVndkDependencyTestCases => prep = 0 ms || clean = 636 ms
    armeabi-v7a GtsDozeDeviceTestCases => prep = 4169 ms || clean = 1324 ms
    armeabi-v7a GtsPackageManagerHostTestCases => prep = 0 ms || clean = 678 ms
    armeabi-v7a GtsKidsHomeHostTestCases => prep = 0 ms || clean = 622 ms
    armeabi-v7a GtsDeviceConfigTestCases => prep = 1479 ms || clean = 1318 ms
    armeabi-v7a GtsThemingTestCases => prep = 3936 ms || clean = 1330 ms
    armeabi-v7a GtsAppVisibilityDeviceTestCases => prep = 4674 ms || clean = 2008 ms
    armeabi-v7a GtsPermissionControllerHostTestCases => prep = 274 ms || clean = 786 ms
    armeabi-v7a GtsUnofficialApisUsageTestCases => prep = 97 ms || clean = 578 ms
    armeabi-v7a GtsLocationHostTestCases => prep = 7 ms || clean = 842 ms
    armeabi-v7a CtsEdiHostTestCases => prep = 0 ms || clean = 609 ms
    armeabi-v7a GtsDevicePolicyTestCases => prep = 8806 ms || clean = 1388 ms
    armeabi-v7a GtsPreserveLegacyStorageHostTest => prep = 10351 ms || clean = 902 ms
    armeabi-v7a GtsHealthConnectTests => prep = 4374 ms || clean = 1481 ms
    armeabi-v7a GtsBootHealthHostTestCases => prep = 0 ms || clean = 629 ms
    armeabi-v7a GtsYouTubeTestCases => prep = 33691 ms || clean = 1607 ms
    armeabi-v7a GtsBackupTestCases => prep = 12797 ms || clean = 3863 ms
    armeabi-v7a GtsSetupWizardNoPermissionTestCases => prep = 3437 ms || clean = 1254 ms
    armeabi-v7a GtsSetupWizardHostTestCases => prep = 3497 ms || clean = 1278 ms
    armeabi-v7a GtsInstantAppsHostTestCases => prep = 0 ms || clean = 796 ms
    armeabi-v7a GtsCastHostTestCases => prep = 3604 ms || clean = 932 ms
    armeabi-v7a CtsClasspathDeviceInfoTestCases => prep = 0 ms || clean = 579 ms
    armeabi-v7a GtsWebViewHostTestCases => prep = 0 ms || clean = 630 ms
    armeabi-v7a GtsRollbackManagerTest => prep = 0 ms || clean = 2123 ms
    armeabi-v7a GtsPermissionUiTestCases => prep = 6409 ms || clean = 2035 ms
    armeabi-v7a GtsAssistIntentTestCases => prep = 10803 ms || clean = 2519 ms
    armeabi-v7a GtsPackageInstallTestCases => prep = 4554 ms || clean = 1580 ms
    armeabi-v7a GtsMemoryHostTestCases => prep = 4439 ms || clean = 1538 ms
    armeabi-v7a GtsTetheringTestCases => prep = 3607 ms || clean = 1296 ms
    armeabi-v7a GtsGmscoreHostTestCases => prep = 8820 ms || clean = 3132 ms
    armeabi-v7a GtsCNGCoreTestCases => prep = 3548 ms || clean = 1286 ms
    armeabi-v7a GtsPermissionTestCases => prep = 5109 ms || clean = 1934 ms
    armeabi-v7a GtsPackageNameCertPairsDeviceTestCases => prep = 4344 ms || clean = 1464 ms
    armeabi-v7a GtsEntertainmentSpaceDeviceTestCases => prep = 3415 ms || clean = 1192 ms
    armeabi-v7a GtsCalendarTests => prep = 3535 ms || clean = 1215 ms
    armeabi-v7a GtsAppBlacklistDeviceTestCases => prep = 4507 ms || clean = 1424 ms
    armeabi-v7a GtsBackupHostTestCases => prep = 17104 ms || clean = 5682 ms
    armeabi-v7a GtsAppTestCases => prep = 17124 ms || clean = 3905 ms
    armeabi-v7a GtsContactsTest => prep = 3585 ms || clean = 1368 ms
    armeabi-v7a GtsTvBugReportTestCases => prep = 3670 ms || clean = 1353 ms
    armeabi-v7a GtsTelephonyTestCases => prep = 6735 ms || clean = 1786 ms
    armeabi-v7a GtsSensorHostTestCases => prep = 0 ms || clean = 829 ms
    armeabi-v7a GtsDevicePolicyGmsInstrumentationTestCases => prep = 8425 ms || clean = 1323 ms
    armeabi-v7a GtsIncidentManagerTestCases => prep = 3895 ms || clean = 1279 ms
    armeabi-v7a GtsOemLockServiceTestCases => prep = 3341 ms || clean = 1302 ms
    armeabi-v7a GtsWellbeingHostTestCases => prep = 1882 ms || clean = 1371 ms
    armeabi-v7a GtsCameraTestCases => prep = 3650 ms || clean = 1359 ms
    armeabi-v7a GtsSimAppDialogTestCases => prep = 3700 ms || clean = 1267 ms
    armeabi-v7a GtsNetStatsHostTestCases => prep = 6625 ms || clean = 2186 ms
    armeabi-v7a GtsAdminTestCases => prep = 3453 ms || clean = 1192 ms
    armeabi-v7a GtsVoiceInteractionHostTestCases => prep = 7 ms || clean = 580 ms
    armeabi-v7a GtsWellbeingTestCases => prep = 3547 ms || clean = 1320 ms
    armeabi-v7a GtsContextHubPermissionDeviceTestCases => prep = 4590 ms || clean = 1514 ms
    armeabi-v7a GtsIntelligenceTestCases => prep = 3512 ms || clean = 1260 ms
    armeabi-v7a GtsNmgiarcTestCases => prep = 4377 ms || clean = 1596 ms
    armeabi-v7a GtsLocationTestCases => prep = 7557 ms || clean = 1507 ms
    armeabi-v7a GtsPackageInstallerTapjackingTestCases => prep = 4681 ms || clean = 1956 ms
    armeabi-v7a GtsPropertiesTestCases => prep = 3793 ms || clean = 1260 ms
    armeabi-v7a GtsSsaidHostTestCases => prep = 3090 ms || clean = 1880 ms
    armeabi-v7a GtsPackageUninstallTestCases => prep = 5983 ms || clean = 1862 ms
    armeabi-v7a GtsPlacementTestCases => prep = 4420 ms || clean = 1383 ms
    armeabi-v7a GtsSecurityHostTestCases => prep = 401 ms || clean = 866 ms
    armeabi-v7a GtsAssistantHostTestCases => prep = 3763 ms || clean = 1198 ms
    armeabi-v7a GtsEdiHostTestCases => prep = 4282 ms || clean = 1501 ms
    armeabi-v7a GtsPlayStoreHostTestCases => prep = 13660 ms || clean = 5496 ms
    armeabi-v7a GtsPartnerBookmarksTestCases => prep = 3592 ms || clean = 1324 ms
    armeabi-v7a GtsPlayAutoInstallTestCases => prep = 3793 ms || clean = 1295 ms
    armeabi-v7a GtsFeaturesTestCases => prep = 2157 ms || clean = 1661 ms
    armeabi-v7a GtsNotificationTestCases => prep = 1323 ms || clean = 1458 ms
    armeabi-v7a GtsNetTestCases => prep = 5017 ms || clean = 1320 ms
    armeabi-v7a GtsSearchHostTestCases => prep = 7 ms || clean = 604 ms
    armeabi-v7a GtsRegulationComplianceTestCases => prep = 3476 ms || clean = 1333 ms
    armeabi-v7a GtsSuspendAppsPermissionTestCases => prep = 4856 ms || clean = 2075 ms
    armeabi-v7a GtsNoPermissionTestCases => prep = 4541 ms || clean = 1426 ms
    armeabi-v7a GtsSafetyCenterTestCases => prep = 3411 ms || clean = 1233 ms
    armeabi-v7a GtsNetworkStackHostTestCases => prep = 8 ms || clean = 631 ms
    armeabi-v7a GtsSpeechServicesTestCases => prep = 3461 ms || clean = 1257 ms
    armeabi-v7a GtsSupervisionTestCases => prep = 3558 ms || clean = 1306 ms
    armeabi-v7a GtsInstallPackagesWhitelistDeviceTestCases => prep = 4466 ms || clean = 1539 ms
    armeabi-v7a GtsPackageRoleEnforcementTests => prep = 3803 ms || clean = 1288 ms
    armeabi-v7a GtsStagedInstallHostTestCases => prep = 8896 ms || clean = 2025 ms
    armeabi-v7a GtsExoPlayerTestCases => prep = 5359 ms || clean = 1925 ms
    armeabi-v7a GtsMbaPrivilegedPermissionTestCases => prep = 3898 ms || clean = 1465 ms
    armeabi-v7a GtsContentHostTestCases => prep = 6298 ms || clean = 1500 ms
    armeabi-v7a GtsBootStatsTestCases => prep = 0 ms || clean = 2184 ms
    armeabi-v7a GtsStatsdHostTestCases => prep = 10256 ms || clean = 1193 ms
    armeabi-v7a GtsDuoReadyTestCases => prep = 5285 ms || clean = 1587 ms
    armeabi-v7a GtsModuleMetadataTestCases => prep = 3559 ms || clean = 1239 ms
    armeabi-v7a GtsNoPermissionTestCases25 => prep = 4377 ms || clean = 1330 ms
    armeabi-v7a GtsSettingsTestCases => prep = 3611 ms || clean = 1279 ms
    armeabi-v7a GtsSettingsHostTestCases => prep = 0 ms || clean = 683 ms
    armeabi-v7a GtsScreenshotHostTestCases => prep = 7 ms || clean = 578 ms
    armeabi-v7a GtsTvHostTestCases => prep = 0 ms || clean = 835 ms
    armeabi-v7a GtsLensTestCases => prep = 3902 ms || clean = 1338 ms
    armeabi-v7a GtsLargeApkHostTestCases => prep = 0 ms || clean = 797 ms
    armeabi-v7a GtsSuspendAppsTestCases => prep = 7406 ms || clean = 3349 ms
    armeabi-v7a GtsCallLogTestCases => prep = 3467 ms || clean = 1350 ms
    armeabi-v7a GtsPrintTestCases => prep = 4459 ms || clean = 1424 ms
    armeabi-v7a GtsEntertainmentSpaceHostTestCases => prep = 0 ms || clean = 641 ms
    armeabi-v7a GtsRlzTestCases => prep = 3450 ms || clean = 1334 ms
    armeabi-v7a GtsGraphicsHostTestCases => prep = 0 ms || clean = 604 ms
    armeabi-v7a GtsTvTestCases => prep = 4561 ms || clean = 1853 ms
    armeabi-v7a GtsSmartBatteryDeviceTestCases => prep = 3412 ms || clean = 1358 ms
    armeabi-v7a GtsWallpaperTestCases => prep = 3413 ms || clean = 1363 ms
    armeabi-v7a GtsContactsAppDeviceTestCases => prep = 3954 ms || clean = 1264 ms
    armeabi-v7a GtsWebViewTestCases => prep = 3564 ms || clean = 1347 ms
    armeabi-v7a GtsPersonalSafetyTestCases => prep = 3972 ms || clean = 1338 ms
    armeabi-v7a GtsGameOverlayTestCases => prep = 0 ms || clean = 581 ms
    armeabi-v7a GtsUserspaceRebootHostSideTestCases => prep = 0 ms || clean = 648 ms
    armeabi-v7a GtsMediaTestCases => prep = 12179 ms || clean = 5103 ms
    armeabi-v7a GtsMemoryTestCases => prep = 4539 ms || clean = 1468 ms
    armeabi-v7a GtsHomeHostTestCases => prep = 181 ms || clean = 678 ms
    armeabi-v7a GtsNetworkWatchlistTestCases => prep = 4092 ms || clean = 1400 ms
    armeabi-v7a GtsTelecomManagerTests => prep = 3415 ms || clean = 1219 ms
    armeabi-v7a GtsIncrementalInstallProxyHostTestCases => prep = 1236 ms || clean = 1790 ms
    armeabi-v7a GtsDozeHostSideTestCases => prep = 3451 ms || clean = 1285 ms
    armeabi-v7a GtsFilesByGoogleTestCases => prep = 3475 ms || clean = 1229 ms
    armeabi-v7a GtsTelephonyNumberVerificationHostCases => prep = 0 ms || clean = 802 ms
    armeabi-v7a GtsContentTestCases => prep = 5193 ms || clean = 1472 ms
    armeabi-v7a GtsAssistantMicHostTestCases => prep = 3701 ms || clean = 1427 ms
    armeabi-v7a GtsDialerAudioTestCases => prep = 4503 ms || clean = 1656 ms
Total preparation time: 8m 57s  ||  Total tear down time: 3m 11s
=======================================================
=============== Summary ===============
Total Run time: 9m 38s
130/132 modules completed
Module(s) with run failure(s):
    armeabi-v7a CtsScopedStorageHostTest: There were 4 failures:
  com.android.tradefed.targetprep.TargetSetupError[APK_INSTALLATION_FAILED|520001|DEPENDENCY_ISSUE]: Failed to install android.scopedstorage.cts.testapp.A.withres with [./../../android-gts/testcases/CtsScopedStorageHostTest/CtsScopedStorageTestAppA.apk] on SKBFXYVH0JEC. Reason: 'INSTALL_FAILED_OLDER_SDK: Failed parse during installPackageLI: /data/app/vmdl1112587198.tmp/base.apk (at Binary XML file line #18): Requires newer sdk version #30 (current version is #29)' [SKBFXYVH0JEC sequoia:bfx-ua300 QT]
	at com.android.tradefed.targetprep.TestAppInstallSetup.installSinglePackage(TestAppInstallSetup.java:558)
	at com.android.tradefed.targetprep.TestAppInstallSetup.installer(TestAppInstallSetup.java:525)
	at com.android.tradefed.targetprep.TestAppInstallSetup.setUp(TestAppInstallSetup.java:413)
	at com.android.tradefed.testtype.suite.ModuleDefinition.runPreparerSetup(ModuleDefinition.java:999)
	at com.android.tradefed.testtype.suite.ModuleDefinition.runTargetPreparation(ModuleDefinition.java:1432)
	at com.android.tradefed.testtype.suite.ModuleDefinition.runPreparation(ModuleDefinition.java:958)
	at com.android.tradefed.testtype.suite.ModuleDefinition.run(ModuleDefinition.java:484)
	at com.android.tradefed.testtype.suite.ITestSuite.runSingleModule(ITestSuite.java:937)
	at com.android.tradefed.testtype.suite.ITestSuite.run(ITestSuite.java:817)
	at com.android.tradefed.invoker.shard.TestsPoolPoller.run(TestsPoolPoller.java:161)
	at com.android.tradefed.invoker.InvocationExecution.runTest(InvocationExecution.java:1336)
	at com.android.tradefed.invoker.InvocationExecution.runTests(InvocationExecution.java:1115)
	at com.android.tradefed.invoker.TestInvocation.prepareAndRun(TestInvocation.java:617)
	at com.android.tradefed.invoker.TestInvocation.performInvocation(TestInvocation.java:275)
	at com.android.tradefed.invoker.TestInvocation.invoke(TestInvocation.java:1335)
	at com.android.tradefed.command.CommandScheduler$InvocationThread.run(CommandScheduler.java:678)

  com.android.tradefed.targetprep.TargetSetupError[APK_INSTALLATION_FAILED|520001|DEPENDENCY_ISSUE]: Failed to install android.scopedstorage.cts.testapp.A.withres with [./../../android-gts/testcases/CtsScopedStorageHostTest/CtsScopedStorageTestAppA.apk] on SKBFXYVH0JEC. Reason: 'INSTALL_FAILED_OLDER_SDK: Failed parse during installPackageLI: /data/app/vmdl1779479843.tmp/base.apk (at Binary XML file line #18): Requires newer sdk version #30 (current version is #29)' [SKBFXYVH0JEC sequoia:bfx-ua300 QT]
	at com.android.tradefed.targetprep.TestAppInstallSetup.installSinglePackage(TestAppInstallSetup.java:558)
	at com.android.tradefed.targetprep.TestAppInstallSetup.installer(TestAppInstallSetup.java:525)
	at com.android.tradefed.targetprep.TestAppInstallSetup.setUp(TestAppInstallSetup.java:413)
	at com.android.tradefed.testtype.suite.ModuleDefinition.runPreparerSetup(ModuleDefinition.java:999)
	at com.android.tradefed.testtype.suite.ModuleDefinition.runTargetPreparation(ModuleDefinition.java:1432)
	at com.android.tradefed.testtype.suite.ModuleDefinition.runPreparation(ModuleDefinition.java:958)
	at com.android.tradefed.testtype.suite.ModuleDefinition.run(ModuleDefinition.java:484)
	at com.android.tradefed.testtype.suite.ITestSuite.runSingleModule(ITestSuite.java:937)
	at com.android.tradefed.testtype.suite.ITestSuite.run(ITestSuite.java:817)
	at com.android.tradefed.invoker.shard.TestsPoolPoller.run(TestsPoolPoller.java:161)
	at com.android.tradefed.invoker.InvocationExecution.runTest(InvocationExecution.java:1336)
	at com.android.tradefed.invoker.InvocationExecution.runTests(InvocationExecution.java:1115)
	at com.android.tradefed.invoker.TestInvocation.prepareAndRun(TestInvocation.java:617)
	at com.android.tradefed.invoker.TestInvocation.performInvocation(TestInvocation.java:275)
	at com.android.tradefed.invoker.TestInvocation.invoke(TestInvocation.java:1335)
	at com.android.tradefed.command.CommandScheduler$InvocationThread.run(CommandScheduler.java:678)

  com.android.tradefed.targetprep.TargetSetupError[APK_INSTALLATION_FAILED|520001|DEPENDENCY_ISSUE]: Failed to install android.scopedstorage.cts.testapp.A.withres with [./../../android-gts/testcases/CtsScopedStorageHostTest/CtsScopedStorageTestAppA.apk] on SKBFXYVH0JEC. Reason: 'INSTALL_FAILED_OLDER_SDK: Failed parse during installPackageLI: /data/app/vmdl1504912345.tmp/base.apk (at Binary XML file line #18): Requires newer sdk version #30 (current version is #29)' [SKBFXYVH0JEC sequoia:bfx-ua300 QT]
	at com.android.tradefed.targetprep.TestAppInstallSetup.installSinglePackage(TestAppInstallSetup.java:558)
	at com.android.tradefed.targetprep.TestAppInstallSetup.installer(TestAppInstallSetup.java:525)
	at com.android.tradefed.targetprep.TestAppInstallSetup.setUp(TestAppInstallSetup.java:413)
	at com.android.tradefed.testtype.suite.ModuleDefinition.runPreparerSetup(ModuleDefinition.java:999)
	at com.android.tradefed.testtype.suite.ModuleDefinition.runTargetPreparation(ModuleDefinition.java:1432)
	at com.android.tradefed.testtype.suite.ModuleDefinition.runPreparation(ModuleDefinition.java:958)
	at com.android.tradefed.testtype.suite.ModuleDefinition.run(ModuleDefinition.java:484)
	at com.android.tradefed.testtype.suite.ITestSuite.runSingleModule(ITestSuite.java:937)
	at com.android.tradefed.testtype.suite.ITestSuite.run(ITestSuite.java:817)
	at com.android.tradefed.invoker.shard.TestsPoolPoller.run(TestsPoolPoller.java:161)
	at com.android.tradefed.invoker.InvocationExecution.runTest(InvocationExecution.java:1336)
	at com.android.tradefed.invoker.InvocationExecution.runTests(InvocationExecution.java:1115)
	at com.android.tradefed.invoker.TestInvocation.prepareAndRun(TestInvocation.java:617)
	at com.android.tradefed.invoker.TestInvocation.performInvocation(TestInvocation.java:275)
	at com.android.tradefed.invoker.TestInvocation.invoke(TestInvocation.java:1335)
	at com.android.tradefed.command.CommandScheduler$InvocationThread.run(CommandScheduler.java:678)

  com.android.tradefed.targetprep.TargetSetupError[APK_INSTALLATION_FAILED|520001|DEPENDENCY_ISSUE]: Failed to install android.scopedstorage.cts.testapp.A.withres with [./../../android-gts/testcases/CtsScopedStorageHostTest/CtsScopedStorageTestAppA.apk] on SKBFXYVH0JEC. Reason: 'INSTALL_FAILED_OLDER_SDK: Failed parse during installPackageLI: /data/app/vmdl280806120.tmp/base.apk (at Binary XML file line #18): Requires newer sdk version #30 (current version is #29)' [SKBFXYVH0JEC sequoia:bfx-ua300 QT]
	at com.android.tradefed.targetprep.TestAppInstallSetup.installSinglePackage(TestAppInstallSetup.java:558)
	at com.android.tradefed.targetprep.TestAppInstallSetup.installer(TestAppInstallSetup.java:525)
	at com.android.tradefed.targetprep.TestAppInstallSetup.setUp(TestAppInstallSetup.java:413)
	at com.android.tradefed.testtype.suite.ModuleDefinition.runPreparerSetup(ModuleDefinition.java:999)
	at com.android.tradefed.testtype.suite.ModuleDefinition.runTargetPreparation(ModuleDefinition.java:1432)
	at com.android.tradefed.testtype.suite.ModuleDefinition.runPreparation(ModuleDefinition.java:958)
	at com.android.tradefed.testtype.suite.ModuleDefinition.run(ModuleDefinition.java:484)
	at com.android.tradefed.testtype.suite.ITestSuite.runSingleModule(ITestSuite.java:937)
	at com.android.tradefed.testtype.suite.ITestSuite.run(ITestSuite.java:817)
	at com.android.tradefed.invoker.shard.TestsPoolPoller.run(TestsPoolPoller.java:161)
	at com.android.tradefed.invoker.InvocationExecution.runTest(InvocationExecution.java:1336)
	at com.android.tradefed.invoker.InvocationExecution.runTests(InvocationExecution.java:1115)
	at com.android.tradefed.invoker.TestInvocation.prepareAndRun(TestInvocation.java:617)
	at com.android.tradefed.invoker.TestInvocation.performInvocation(TestInvocation.java:275)
	at com.android.tradefed.invoker.TestInvocation.invoke(TestInvocation.java:1335)
	at com.android.tradefed.command.CommandScheduler$InvocationThread.run(CommandScheduler.java:678)

    armeabi-v7a GtsMediaTestCases: Instrumentation run failed due to 'Process crashed.'
Java Crash Messages sorted from most recent:
Failed to allocate a 4112 byte allocation with 3992 free bytes and 3992B until OOM, target footprint 268435456, growth limit 268435456
java.lang.OutOfMemoryError: Failed to allocate a 4112 byte allocation with 3992 free bytes and 3992B until OOM, target footprint 268435456, growth limit 268435456
	at com.google.android.media.gts.videoplayer.AudioAgent.actOn(AudioAgent.java:48)
	at com.google.android.media.gts.videoplayer.CodecConsumer.tick(CodecConsumer.java:124)
	at com.google.android.media.gts.videoplayer.CodecHandler.tick(CodecHandler.java:116)
	at com.google.android.media.gts.videoplayer.CodecHandler.tryRun(CodecHandler.java:92)
	at com.google.android.media.gts.videoplayer.CodecHandler.run(CodecHandler.java:63)
	at com.google.android.media.gts.videoplayer.BasePlayer$1.run(BasePlayer.java:176)
Failed to allocate a 1653608 byte allocation with 233672 free bytes and 228KB until OOM, target footprint 268435456, growth limit 268435456
java.lang.OutOfMemoryError: Failed to allocate a 1653608 byte allocation with 233672 free bytes and 228KB until OOM, target footprint 268435456, growth limit 268435456
	at dalvik.system.VMRuntime.newNonMovableArray(Native Method)
	at java.nio.DirectByteBuffer$MemoryRef.<init>(DirectByteBuffer.java:70)
	at java.nio.ByteBuffer.allocateDirect(ByteBuffer.java:258)
	at com.google.android.exoplayer2.decoder.DecoderInputBuffer.createReplacementByteBuffer(DecoderInputBuffer.java:201)
	at com.google.android.exoplayer2.decoder.DecoderInputBuffer.ensureSpaceForWrite(DecoderInputBuffer.java:136)
	at com.google.android.exoplayer2.source.SampleDataQueue.readToBuffer(SampleDataQueue.java:145)
	at com.google.android.exoplayer2.source.SampleQueue.read(SampleQueue.java:330)
	at com.google.android.exoplayer2.source.ProgressiveMediaPeriod.readData(ProgressiveMediaPeriod.java:478)
	at com.google.android.exoplayer2.source.ProgressiveMediaPeriod$SampleStreamImpl.readData(ProgressiveMediaPeriod.java:894)
	at com.google.android.media.gts.extractor.ExoPlayer2ExtractorAdapter$7.run(ExoPlayer2ExtractorAdapter.java:565)
	at com.google.android.media.gts.extractor.ExoPlayer2ExtractorAdapter$7.run(ExoPlayer2ExtractorAdapter.java:555)
	at com.google.android.media.gts.extractor.LooperThread$3.run(LooperThread.java:93)
	at android.os.Handler.handleCallback(Handler.java:883)
	at android.os.Handler.dispatchMessage(Handler.java:100)
	at android.os.Looper.loop(Looper.java:214)
	at android.os.HandlerThread.run(HandlerThread.java:67)
Total Tests       : 2034
PASSED            : 1310
FAILED            : 15
IGNORED           : 12
ASSUMPTION_FAILURE: 633
IMPORTANT: Some modules failed to run to completion, tests counts may be inaccurate.
Shard 0 used: [SKBFXYVH0JD7]
Shard 1 used: [SKBFXYVH0JEC]
============== End of Results ==============
============================================
